cargo rustc --release -- --emit link=Blini-8DCFC286
Updating crates.io index
Downloading crates ...
Downloaded indenter v0.3.4
Downloaded autocfg v1.5.1
Downloaded lazy_static v1.5.0
Downloaded cfg-if v1.0.5
Downloaded eyre v0.6.14
Downloaded color-spantrace v0.3.0
Downloaded thread_local v1.1.10
Downloaded tracing-error v0.2.1
Downloaded pin-project-lite v0.2.17
Downloaded thiserror v2.0.21
Downloaded thiserror-impl v2.0.21
Downloaded owo-colors v4.4.0
Downloaded rustc-demangle v0.1.28
Downloaded sharded-slab v0.1.7
Downloaded tracing-core v0.1.36
Downloaded backtrace v0.3.76
Downloaded memchr v2.8.3
Downloaded tracing-subscriber v0.3.23
Downloaded tracing v0.1.44
Downloaded color-eyre v0.6.5
Compiling cfg-if v1.0.5
Compiling proc-macro2 v1.0.107
Compiling quote v1.0.47
Compiling unicode-ident v1.0.24
Compiling once_cell v1.21.4
Compiling libc v0.2.189
Compiling lazy_static v1.5.0
Compiling pin-project-lite v0.2.17
Compiling object v0.37.3
Compiling autocfg v1.5.1
Compiling gimli v0.32.3
Compiling adler2 v2.0.1
Compiling color-spantrace v0.3.0
Compiling getrandom v0.4.3
Compiling memchr v2.8.3
Compiling rand_core v0.10.1
Compiling sharded-slab v0.1.7
Compiling thread_local v1.1.10
Compiling miniz_oxide v0.8.9
Compiling owo-colors v4.4.0
Compiling rustc-demangle v0.1.28
Compiling thiserror v2.0.21
Compiling tracing-core v0.1.36
Compiling indenter v0.3.4
Compiling cpufeatures v0.3.1
Compiling chacha20 v0.10.2
Compiling arrayvec v0.7.8
Compiling eyre v0.6.14
Compiling tracing-subscriber v0.3.23
Compiling tracing v0.1.44
Compiling syn v3.0.5
Compiling rand v0.10.2
Compiling tracing-error v0.2.1
Compiling addr2line v0.25.1
Compiling thiserror-impl v2.0.21
Compiling enum-map-derive v1.0.1
Compiling enum-map v3.1.0
Compiling backtrace v0.3.76
Compiling color-eyre v0.6.5
Compiling blini v0.1.0 (/tmp/tmp2i83nny7/Blini/Blini-tmp)
error[E0658]: use of unstable library feature `result_option_map_or_default`
--> src/board/movegen.rs:115:14
|
115 | .map_or_default(super::super::common::square::Square::to_bb)
| ^^^^^^^^^^^^^^
|
= note: see issue #138099 <https://github.com/rust-lang/rust/issues/138099> for more information
= help: add `#![feature(result_option_map_or_default)]` to the crate attributes to enable
= note: this compiler was built on 2026-05-17; consider upgrading it if it is out of date
error[E0658]: use of unstable library feature `result_option_map_or_default`
--> src/board/movegen.rs:118:18
|
118 | .map_or_default(super::super::common::square::Square::to_bb))
| ^^^^^^^^^^^^^^
|
= note: see issue #138099 <https://github.com/rust-lang/rust/issues/138099> for more information
= help: add `#![feature(result_option_map_or_default)]` to the crate attributes to enable
= note: this compiler was built on 2026-05-17; consider upgrading it if it is out of date
error[E0658]: use of unstable library feature `result_option_map_or_default`
--> src/board/movegen.rs:236:18
|
236 | .map_or_default(super::super::common::square::Square::to_bb);
| ^^^^^^^^^^^^^^
|
= note: see issue #138099 <https://github.com/rust-lang/rust/issues/138099> for more information
= help: add `#![feature(result_option_map_or_default)]` to the crate attributes to enable
= note: this compiler was built on 2026-05-17; consider upgrading it if it is out of date
error[E0658]: use of unstable library feature `result_option_map_or_default`
--> src/board/movegen.rs:239:18
|
239 | .map_or_default(super::super::common::square::Square::to_bb);
| ^^^^^^^^^^^^^^
|
= note: see issue #138099 <https://github.com/rust-lang/rust/issues/138099> for more information
= help: add `#![feature(result_option_map_or_default)]` to the crate attributes to enable
= note: this compiler was built on 2026-05-17; consider upgrading it if it is out of date
error[E0658]: use of unstable library feature `result_option_map_or_default`
--> src/board/movegen.rs:353:18
|
353 | .map_or_default(super::super::common::square::Square::to_bb);
| ^^^^^^^^^^^^^^
|
= note: see issue #138099 <https://github.com/rust-lang/rust/issues/138099> for more information
= help: add `#![feature(result_option_map_or_default)]` to the crate attributes to enable
= note: this compiler was built on 2026-05-17; consider upgrading it if it is out of date
error[E0658]: use of unstable library feature `result_option_map_or_default`
--> src/board/movegen.rs:356:18
|
356 | .map_or_default(super::super::common::square::Square::to_bb);
| ^^^^^^^^^^^^^^
|
= note: see issue #138099 <https://github.com/rust-lang/rust/issues/138099> for more information
= help: add `#![feature(result_option_map_or_default)]` to the crate attributes to enable
= note: this compiler was built on 2026-05-17; consider upgrading it if it is out of date
For more information about this error, try `rustc --explain E0658`.
error: could not compile `blini` (bin "blini") due to 6 previous errors
make: *** [Makefile:10: native] Error 101