MattBench MattBench Event details n9x.co

Event details

python3 ./download_net.py
Downloading net challah to ./nets/wakwak.nnue
cargo rustc --release --features tune -- --emit link=WakWak-C620760A
   Compiling proc-macro2 v1.0.107
   Compiling unicode-ident v1.0.24
   Compiling quote v1.0.47
   Compiling libc v0.2.189
   Compiling zerocopy v0.8.56
   Compiling thiserror v2.0.20
   Compiling wakwak v0.16.0 (/tmp/tmpi5pas5xu/WakWak/WakWak-tmp)
   Compiling arrayvec v0.7.8
   Compiling colored v3.1.1
   Compiling syn v3.0.5
   Compiling atomic-wait v1.1.0
   Compiling thiserror-impl v2.0.20
   Compiling enum-map-derive v1.0.1
   Compiling enum-map v3.1.0
error[E0599]: no associated function or constant named `print_uci` found for struct `params::Params` in the current scope
   --> src/engine.rs:134:17
    |
134 |         Params::print_uci();
    |                 ^^^^^^^^^ associated function or constant not found in `params::Params`
    |
   ::: src/search/params.rs:16:9
    |
 16 |         pub struct Params;
    |         ----------------- associated function or constant `print_uci` not found for this struct

error[E0599]: no associated function or constant named `print_spsa` found for struct `params::Params` in the current scope
   --> src/engine.rs:141:17
    |
141 |         Params::print_spsa()
    |                 ^^^^^^^^^^ associated function or constant not found in `params::Params`
    |
   ::: src/search/params.rs:16:9
    |
 16 |         pub struct Params;
    |         ----------------- associated function or constant `print_spsa` not found for this struct

For more information about this error, try `rustc --explain E0599`.
error: could not compile `wakwak` (bin "wakwak") due to 2 previous errors
make: *** [Makefile:14: native] Error 101